�{�ݔԍ�,�����Ǘ��ԍ�,����ID,���Ҏ���,���Ҏ���_�J�i,���N����,����,���@��,�މ@��,�މ@���]�A,�g��,�̏d,��������,�����`��,�����o�H,�����敪,�ً}�R�[��,�S��~�h����,�ē���,�a���e�L�X�g,��p���e�L�X�g,��a���R�[�h,���a���R�[�h1,���a���R�[�h2,���a���R�[�h3,���a���R�[�h4,���a���R�[�h5,�ގ�����,�ގ����]�A,���������C��,���S�Ö����C��,�l�H�ċz�J�n1,�l�H�ċz�I��1,�l�H�ċz�J�n2,�l�H�ċz�I��2,�l�H�ċz�J�n3,�l�H�ċz�I��3,�l�H�ċz�J�n4,�l�H�ċz�I��4,�l�H�ċz�J�n5,�l�H�ċz�I��5,�l�H�ċz�J�n6,�l�H�ċz�I��6,�l�H�ċz�J�n7,�l�H�ċz�I��7,�l�H�ċz�J�n8,�l�H�ċz�I��8,�l�H�ċz�J�n9,�l�H�ċz�I��9,�l�H�ċz�J�n10,�l�H�ċz�I��10,�l�H�ċz�J�n11,�l�H�ċz�I��11,�l�H�ċz�J�n12,�l�H�ċz�I��12,�l�H�ċz�J�n13,�l�H�ċz�I��13,�l�H�ċz�J�n14,�l�H�ċz�I��14,�l�H�ċz�J�n15,�l�H�ċz�I��15,�l�H�ċz�J�n16,�l�H�ċz�I��16,�l�H�ċz�J�n17,�l�H�ċz�I��17,�l�H�ċz�J�n18,�l�H�ċz�I��18,�l�H�ċz�J�n19,�l�H�ċz�I��19,�l�H�ċz�J�n20,�l�H�ċz�I��20,NPPV,�C�ǐ؊J,�C�ǐ؊J�{�s��,IABP,PCPS,VV_ECMO,�Ԍ��t��֗Ö@,�����t��֗Ö@,��������,PMX,���̑��̌��t��,AIDS,�S�s�S,�ċz�s�S,�̕s�S,�̍d��,AML_MM,�����p��,���]��,�Ɖu�}��,�ێ�����,���k������,���E�U��,FiO2_����,PaO2_����,BE,�l�H�ċz_����,�p��̉񕜖ړI,�l�H�S�x�g�p��,�����X�N�f�f��,�჊�X�N�f�f��,�����[�ō�,�����[�Œ�,���k�������[�ō�,���k�������[�Œ�,���ό����[�ō�,���ό����[�Œ�,�g���������[�ō�,�g���������[�Œ�,�̉��[�ō�,�̉��[�Œ�,�ċz���[�ō�,�ċz���[�Œ�,GCS_E,GCS_V,GCS_M,�w�}�g�N���b�g�[�ō�,�w�}�g�N���b�g�[�Œ�,���������[�ō�,���������[�Œ�,�N���A�`�j���[�ō�,�N���A�`�j���[�Œ�,BUN�[�ō�,������24���Ԃ̔A��,Na�[�ō�,Na�[�Œ�,K�[�ō�,K�[�Œ�,�A���u�~���[�ō�,�A���u�~���[�Œ�,�r�����r���[�ō�,�����[�ō�,�����[�Œ�,������24���Ԉȓ���AKI,������24���Ԉȓ��̐l�H�ċz,������24���Ԉȓ���PAC,CABG�Ď�p,�O���t�g�{��,FiO2_1,PaO2_1,PaCO2_1,pH_1,FiO2_2,PaO2_2,PaCO2_2,pH_2,FiO2_3,PaO2_3,PaCO2_3,pH_3,FiO2_4,PaO2_4,PaCO2_4,pH_4,FiO2_5,PaO2_5,PaCO2_5,pH_5,FiO2_6,PaO2_6,PaCO2_6,pH_6,FiO2_7,PaO2_7,PaCO2_7,pH_7,FiO2_8,PaO2_8,PaCO2_8,pH_8,FiO2_9,PaO2_9,PaCO2_9,pH_9,FiO2_10,PaO2_10,PaCO2_10,pH_10,FiO2_11,PaO2_11,PaCO2_11,pH_11,FiO2_12,PaO2_12,PaCO2_12,pH_12,FiO2_13,PaO2_13,PaCO2_13,pH_13,FiO2_14,PaO2_14,PaCO2_14,pH_14,FiO2_15,PaO2_15,PaCO2_15,pH_15,FiO2_16,PaO2_16,PaCO2_16,pH_16,FiO2_17,PaO2_17,PaCO2_17,pH_17,FiO2_18,PaO2_18,PaCO2_18,pH_18,FiO2_19,PaO2_19,PaCO2_19,pH_19,FiO2_20,PaO2_20,PaCO2_20,pH_20,FiO2_21,PaO2_21,PaCO2_21,pH_21,FiO2_22,PaO2_22,PaCO2_22,pH_22,FiO2_23,PaO2_23,PaCO2_23,pH_23,FiO2_24,PaO2_24,PaCO2_24,pH_24,FiO2_25,PaO2_25,PaCO2_25,pH_25,FiO2_26,PaO2_26,PaCO2_26,pH_26,FiO2_27,PaO2_27,PaCO2_27,pH_27,FiO2_28,PaO2_28,PaCO2_28,pH_28,FiO2_29,PaO2_29,PaCO2_29,pH_29,FiO2_30,PaO2_30,PaCO2_30,pH_30,FiO2_31,PaO2_31,PaCO2_31,pH_31,FiO2_32,PaO2_32,PaCO2_32,pH_32,FiO2_33,PaO2_33,PaCO2_33,pH_33,FiO2_34,PaO2_34,PaCO2_34,pH_34,FiO2_35,PaO2_35,PaCO2_35,pH_35,FiO2_36,PaO2_36,PaCO2_36,pH_36,FiO2_37,PaO2_37,PaCO2_37,pH_37,FiO2_38,PaO2_38,PaCO2_38,pH_38,FiO2_39,PaO2_39,PaCO2_39,pH_39,FiO2_40,PaO2_40,PaCO2_40,pH_40,FiO2_41,PaO2_41,PaCO2_41,pH_41,FiO2_42,PaO2_42,PaCO2_42,pH_42,FiO2_43,PaO2_43,PaCO2_43,pH_43,FiO2_44,PaO2_44,PaCO2_44,pH_44,FiO2_45,PaO2_45,PaCO2_45,pH_45,FiO2_46,PaO2_46,PaCO2_46,pH_46,FiO2_47,PaO2_47,PaCO2_47,pH_47,FiO2_48,PaO2_48,PaCO2_48,pH_48,FiO2_49,PaO2_49,PaCO2_49,pH_49,FiO2_50,PaO2_50,PaCO2_50,pH_50,�������C�ǐ؊J,HFNC,�����[�Œ�,DOB,DOA,NOR,ADR,���_�l,�������X�N�f�f��,�S����p�������͐S�J�e�p��,������a���R�[�h,�������a���R�[�h1,�������a���R�[�h2,�������a���R�[�h3,�������a���R�[�h4,�������a���R�[�h5,PF��
,T00000000001,900000001,�e�X�g����000001,�e�X�g�J���W���O�O�O�O�O�P,1933/10/19,�j��,2019/12/4,2019/12/26,�]�@,181,72.1,2019/12/4 2:36,�ً},��p��,�ً}��p,RRT/MET,Yes,No,�e�X�g�a���P�Q�R�S�T�U�V�W�X,�e�X�g�p���P�Q�R�S�T�U�V�W�X,1703,311,204,1603,1412,107,2019/12/26 5:48,�]�@,No,Yes,,,,,,,,,,,,,,,,,,,,,,,,,,,,,,,,,,,,,,,,,Yes,�o��I,2019/12/4 2:47,No,Yes,Yes,No,Yes,Yes,No,,No,No,Yes,No,Yes,Yes,Yes,No,Yes,No,58,Yes,1,99,13,Yes,No,No,���S��`���ǌ�Q,�b��,165,176,299,86,272,53,258,37,44,35,34,11,1,4,6,52,22,59,3,13,2,10,4569,131,107,9,2,6,3,12,966,64,No,#VALUE!,No,No,,0.9,177,29,7,0.76,549,56,6.5,0.13,589,81,7,0.67,407,30,7.4,0.89,437,41,7.3,0.2,82,54,8.5,,,,,,,,,,,,,,,,,,,,,,,,,,,,,,,,,,,,,,,,,,,,,,,,,,,,,,,,,,,,,,,,,,,,,,,,,,,,,,,,,,,,,,,,,,,,,,,,,,,,,,,,,,,,,,,,,,,,,,,,,,,,,,,,,,,,,,,,,,,,,,,,,,,,,,,,,,,,,,,,,,,,,,,,,,,,,,,,,No,Yes,446,�g�p���Ă��Ȃ�,�g�p���Ă��Ȃ�,�g�p���Ă��Ȃ�,�g�p���Ă��Ȃ�,15,ICU �������O�̐S��~,No,p1308,p0803,p0254,p1104,p1906,p1953,85
,T00000000002,900000002,�e�X�g����000002,�e�X�g�J���W���O�O�O�O�O�Q,1952/6/21,����,2019/10/6,2019/10/7,���S,112,36.4,2019/10/6 13:33,ICU�ł̎�Z,�a��,���p,No,Yes,No,�e�X�g�a���P�Q�R�S�T�U�V�W�X,�e�X�g�p���P�Q�R�S�T�U�V�W�X,401,1211,408,1204,208,1406,2019/10/7 3:37,���S,Yes,No,,,,,,,,,,,,,,,,,,,,,,,,,,,,,,,,,,,,,,,,,Yes,�o��I,2019/10/6 14:35,No,Yes,No,No,Yes,Yes,No,,No,Yes,Yes,Yes,Yes,Yes,No,No,No,Yes,164,No,1,226,5,No,No,No,���S��`���ǌ�Q,�N���[�v,163,114,248,95,217,61,201,44,43,35,44,10,2,2,4,55,11,98,6,14,12,8,5791,160,120,10,1,7,4,26,193,90,No,#VALUE!,No,No,,0.57,388,75,7.1,0.24,568,73,6.8,0.85,218,94,7.2,0.27,310,93,6.7,0.19,179,18,8.7,0.62,363,42,8,,,,,,,,,,,,,,,,,,,,,,,,,,,,,,,,,,,,,,,,,,,,,,,,,,,,,,,,,,,,,,,,,,,,,,,,,,,,,,,,,,,,,,,,,,,,,,,,,,,,,,,,,,,,,,,,,,,,,,,,,,,,,,,,,,,,,,,,,,,,,,,,,,,,,,,,,,,,,,,,,,,,,,,,,,,,,,,,,Yes,No,250,�g�p���Ă��Ȃ�,5microg/kg/min�𒴂�15microg/kg/min�ȉ�,�g�p���Ă��Ȃ�,0.1microg/kg/min�𒴂���,8,�Ȃ�,No,p0429,p0211,p0404,p0206,p0456,p1802,219
,T00000000003,900000003,�e�X�g����000003,�e�X�g�J���W���O�O�O�O�O�R,1979/2/25,�j��,2019/8/24,2019/9/6,���S,118,33.4,2019/8/24 10:03,ICU�ł̎�Z,�~�}�O��,���p,No,Yes,No,�e�X�g�a���P�Q�R�S�T�U�V�W�X,�e�X�g�p���P�Q�R�S�T�U�V�W�X,409,405,504,1506,1506,104,2019/9/6 8:58,���S,No,No,2019/9/6 7:58,2019/9/6 8:58,,,,,,,,,,,,,,,,,,,,,,,,,,,,,,,,,,,,,,,Yes,�o��I,2019/8/24 10:56,No,No,Yes,No,No,Yes,Yes,,Yes,No,No,Yes,Yes,Yes,Yes,Yes,Yes,No,83,No,1,319,-13,Yes,No,No,�S�؏ǂ܂��͐S�؉�,�N���[�v,180,129,201,105,163,68,144,49,41,37,41,11,4,2,5,56,26,26,6,15,4,51,8449,162,103,7,3,5,4,5,143,5,No,No,No,No,,0.59,333,36,6.3,0.39,366,51,7.8,0.48,144,22,6.4,0.49,314,88,6.1,0.92,592,76,6,0.34,455,63,6.7,,,,,,,,,,,,,,,,,,,,,,,,,,,,,,,,,,,,,,,,,,,,,,,,,,,,,,,,,,,,,,,,,,,,,,,,,,,,,,,,,,,,,,,,,,,,,,,,,,,,,,,,,,,,,,,,,,,,,,,,,,,,,,,,,,,,,,,,,,,,,,,,,,,,,,,,,,,,,,,,,,,,,,,,,,,,,,,,,Yes,No,348,�g�p���Ă��Ȃ�,15microg/kg/min �𒴂���,�g�p���Ă��Ȃ�,0.1microg/kg/min�ȉ�,8,ICU �������O�̐S��~,No,p0604,p0449,p0609,p1993,p1308,p0143,305
,T00000000004,900000004,�e�X�g����000004,�e�X�g�J���W���O�O�O�O�O�S,2012/7/16,�j��,2019/3/18,2019/3/29,����,124,27.7,2019/3/18 17:12,�\��,�~�}�O��,���p,No,No,No,�e�X�g�a���P�Q�R�S�T�U�V�W�X,�e�X�g�p���P�Q�R�S�T�U�V�W�X,212,207,1503,308,308,111,2019/3/29 8:11,���S,Yes,Yes,2019/3/18 17:12,2019/3/29 8:11,,,,,,,,,,,,,,,,,,,,,,,,,,,,,,,,,,,,,,,No,�o��I,2019/3/18 17:31,Yes,Yes,Yes,No,No,Yes,Yes,,No,Yes,Yes,Yes,No,Yes,Yes,No,Yes,No,187,Yes,1,246,-9,Yes,No,No,�Ȃ�,�׋C�ǎx��,242,110,217,133,181,98,163,81,43,37,39,25,2,1,2,57,27,70,3,13,7,11,4611,145,126,9,3,8,2,12,492,62,No,Yes,Yes,No,,0.39,133,31,7.5,0.72,499,15,7.5,0.02,462,35,6.1,0.98,416,49,7.3,0.63,231,36,8.1,0.33,374,36,8.8,,,,,,,,,,,,,,,,,,,,,,,,,,,,,,,,,,,,,,,,,,,,,,,,,,,,,,,,,,,,,,,,,,,,,,,,,,,,,,,,,,,,,,,,,,,,,,,,,,,,,,,,,,,,,,,,,,,,,,,,,,,,,,,,,,,,,,,,,,,,,,,,,,,,,,,,,,,,,,,,,,,,,,,,,,,,,,,,,No,Yes,846,�g�p���Ă��Ȃ�,5microg/kg/min�𒴂�15microg/kg/min�ȉ�,0.1microg/kg/min�𒴂���,0.1microg/kg/min�𒴂���,16,�d�Ǖ������Ɖu�s�S��,Yes,p0827,p0453,p1973,p0403,p1962,p0218,689
,T00000000005,900000005,�e�X�g����000005,�e�X�g�J���W���O�O�O�O�O�T,1931/11/11,����,2019/7/1,2019/7/26,����,133,33.6,2019/7/1 12:36,�ً},�~�}�O��,���p,RRT/MET,Yes,No,�e�X�g�a���P�Q�R�S�T�U�V�W�X,�e�X�g�p���P�Q�R�S�T�U�V�W�X,605,201,1604,109,403,211,2019/7/26 1:42,�]�@,No,No,2019/7/1 13:36,2019/7/26 1:42,,,,,,,,,,,,,,,,,,,,,,,,,,,,,,,,,,,,,,,No,No,,No,Yes,Yes,No,No,No,Yes,,Yes,Yes,No,Yes,No,No,No,Yes,Yes,Yes,96,Yes,1,82,0,No,No,No,���S��`���ǌ�Q,�Ȃ�,267,61,233,98,196,69,177,55,39,35,45,26,1,4,3,37,29,59,5,13,9,45,7649,162,111,6,2,6,3,7,750,45,No,Yes,No,No,,0.9,437,80,8.4,0.99,273,18,6.3,0.15,233,100,8.5,0.62,497,23,7,0.65,546,70,8.7,0.24,47,84,8.1,,,,,,,,,,,,,,,,,,,,,,,,,,,,,,,,,,,,,,,,,,,,,,,,,,,,,,,,,,,,,,,,,,,,,,,,,,,,,,,,,,,,,,,,,,,,,,,,,,,,,,,,,,,,,,,,,,,,,,,,,,,,,,,,,,,,,,,,,,,,,,,,,,,,,,,,,,,,,,,,,,,,,,,,,,,,,,,,,Yes,No,388,�g�p���Ă��Ȃ�,5microg/kg/min�ȉ�,�g�p���Ă��Ȃ�,0.1microg/kg/min�𒴂���,19,�����ڐA���V�s�G���g,Yes,p0308,p0330,p0499,p1977,p1899,p1999,326
,T00000000006,900000006,�e�X�g����000006,�e�X�g�J���W���O�O�O�O�O�U,1941/9/14,�j��,2019/10/5,2019/10/27,���S,162,65.6,2019/10/5 6:31,ICU�ł̎�Z,�a��,���p,No,Yes,Yes,�e�X�g�a���P�Q�R�S�T�U�V�W�X,�e�X�g�p���P�Q�R�S�T�U�V�W�X,111,1403,308,1703,1503,1903,2019/10/27 8:50,���S,No,No,,,,,,,,,,,,,,,,,,,,,,,,,,,,,,,,,,,,,,,,,Yes,No,,Yes,No,Yes,No,No,Yes,Yes,,No,Yes,Yes,Yes,Yes,No,Yes,No,No,No,65,No,1,427,1,Yes,No,No,�O���ɔ���Ȃ��]���o��,���A�a���P�g�A�V�h�[�V�X,259,105,151,73,112,38,93,20,41,35,41,12,1,5,6,57,32,80,8,13,9,16,4105,149,103,10,3,6,3,37,410,25,No,#VALUE!,Yes,No,,0.79,530,21,6,0.32,217,65,7.1,0.3,125,57,7.3,0.42,289,44,7.1,0.07,566,60,6,0.95,168,67,8.4,,,,,,,,,,,,,,,,,,,,,,,,,,,,,,,,,,,,,,,,,,,,,,,,,,,,,,,,,,,,,,,,,,,,,,,,,,,,,,,,,,,,,,,,,,,,,,,,,,,,,,,,,,,,,,,,,,,,,,,,,,,,,,,,,,,,,,,,,,,,,,,,,,,,,,,,,,,,,,,,,,,,,,,,,,,,,,,,,Yes,Yes,984,�g�p���Ă��Ȃ�,5microg/kg/min�𒴂�15microg/kg/min�ȉ�,0.1microg/kg/min�𒴂���,0.1microg/kg/min�ȉ�,7,�Ȃ�,Yes,p0350,p0335,p1701,p0312,p0226,p1599,28
,T00000000007,900000007,�e�X�g����000007,�e�X�g�J���W���O�O�O�O�O�V,2008/2/24,����,2019/1/1,2019/1/6,����,146,49,2019/1/1 23:16,ICU�ł̎�Z,�a��,���p,No,Yes,No,�e�X�g�a���P�Q�R�S�T�U�V�W�X,�e�X�g�p���P�Q�R�S�T�U�V�W�X,108,1502,1203,1902,702,1803,2019/1/6 8:54,���S,Yes,No,,,,,,,,,,,,,,,,,,,,,,,,,,,,,,,,,,,,,,,,,Yes,No,,Yes,Yes,Yes,Yes,Yes,No,Yes,,Yes,Yes,No,Yes,No,Yes,No,No,Yes,No,195,Yes,1,117,-17,No,No,No,HIV������,���������������ċz�iOSA�j,130,189,189,102,157,62,141,42,43,34,38,10,3,3,4,52,35,75,8,14,3,34,3088,140,118,4,1,6,3,2,196,58,No,#VALUE!,Yes,No,,0.03,478,17,6.4,0.89,120,17,8.4,0.47,361,74,8.8,0.72,241,54,7.7,0.93,521,52,7.5,0.83,436,52,8.2,,,,,,,,,,,,,,,,,,,,,,,,,,,,,,,,,,,,,,,,,,,,,,,,,,,,,,,,,,,,,,,,,,,,,,,,,,,,,,,,,,,,,,,,,,,,,,,,,,,,,,,,,,,,,,,,,,,,,,,,,,,,,,,,,,,,,,,,,,,,,,,,,,,,,,,,,,,,,,,,,,,,,,,,,,,,,,,,,No,No,660,�g�p���Ă��Ȃ�,�g�p���Ă��Ȃ�,0.1microg/kg/min�𒴂���,0.1microg/kg/min�𒴂���,11,�̕s�S��ICU �����̎�ړI,Yes,p0211,p0142,p0812,p0802,p0308,p0149,437
,T00000000008,900000008,�e�X�g����000008,�e�X�g�J���W���O�O�O�O�O�W,1935/11/16,�j��,2019/6/12,2019/6/20,�]�@,121,26.4,2019/6/12 14:58,ICU�ł̎�Z,�~�}�O��,���p,No,No,Yes,�e�X�g�a���P�Q�R�S�T�U�V�W�X,�e�X�g�p���P�Q�R�S�T�U�V�W�X,108,1406,702,1211,1207,1705,2019/6/20 7:24,�]�@,Yes,Yes,,,,,,,,,,,,,,,,,,,,,,,,,,,,,,,,,,,,,,,,,Yes,�o��I,2019/6/12 16:06,No,No,No,No,No,No,Yes,,No,No,No,Yes,No,No,Yes,Yes,Yes,No,196,Yes,1,45,-18,Yes,No,No,�Ȃ�,�׋C�ǎx��,262,76,296,111,269,72,255,52,45,37,42,13,4,5,3,50,18,72,7,15,10,93,1540,160,107,9,1,5,1,43,148,75,No,#VALUE!,Yes,No,,0.79,206,60,7.3,0.1,380,85,8.5,0.96,322,79,7.7,0.2,548,56,6.5,0.35,394,78,8.8,0.65,77,70,7.6,,,,,,,,,,,,,,,,,,,,,,,,,,,,,,,,,,,,,,,,,,,,,,,,,,,,,,,,,,,,,,,,,,,,,,,,,,,,,,,,,,,,,,,,,,,,,,,,,,,,,,,,,,,,,,,,,,,,,,,,,,,,,,,,,,,,,,,,,,,,,,,,,,,,,,,,,,,,,,,,,,,,,,,,,,,,,,,,,No,Yes,137,�g�p����,15microg/kg/min �𒴂���,0.1microg/kg/min�ȉ�,�g�p���Ă��Ȃ�,6,ICU �������O�̐S��~,No,p0317,p0434,p0149,p0829,p1605,p1101,157
,T00000000009,900000009,�e�X�g����000009,�e�X�g�J���W���O�O�O�O�O�X,2017/6/22,����,2019/10/26,2019/10/31,����,171,73.1,2019/10/26 9:07,�\��,��p��,�\���p,No,No,Yes,�e�X�g�a���P�Q�R�S�T�U�V�W�X,�e�X�g�p���P�Q�R�S�T�U�V�W�X,1401,405,303,106,403,1205,2019/10/31 23:35,���S,No,Yes,,,,,,,,,,,,,,,,,,,,,,,,,,,,,,,,,,,,,,,,,No,�o��I,2019/10/26 10:28,No,No,Yes,No,No,Yes,Yes,,Yes,No,Yes,No,Yes,No,No,No,No,No,106,No,1,492,14,No,Yes,No,���S��`���ǌ�Q,�׋C�ǎx��,119,105,268,102,233,67,216,50,38,36,36,15,4,1,6,50,32,96,2,13,7,67,6312,162,126,7,3,7,3,1,333,89,No,#VALUE!,No,No,,0.28,105,35,7.6,0.56,473,65,8,0.73,127,21,6.6,0.39,184,64,8.3,0.74,179,51,6.7,0.53,523,100,6.3,,,,,,,,,,,,,,,,,,,,,,,,,,,,,,,,,,,,,,,,,,,,,,,,,,,,,,,,,,,,,,,,,,,,,,,,,,,,,,,,,,,,,,,,,,,,,,,,,,,,,,,,,,,,,,,,,,,,,,,,,,,,,,,,,,,,,,,,,,,,,,,,,,,,,,,,,,,,,,,,,,,,,,,,,,,,,,,,,No,Yes,45,�g�p���Ă��Ȃ�,�g�p���Ă��Ȃ�,�g�p���Ă��Ȃ�,0.1microg/kg/min�𒴂���,13,�Ȃ�,Yes,p1913,p0812,p0143,p1924,p1301,p1108,304
,T00000000010,900000010,�e�X�g����000010,�e�X�g�J���W���O�O�O�O�P�O,2008/3/23,�j��,2019/5/5,2019/5/30,����,182,99.4,2019/5/5 19:24,ICU�ł̎�Z,�~�}�O��,���p,No,Yes,Yes,�e�X�g�a���P�Q�R�S�T�U�V�W�X,�e�X�g�p���P�Q�R�S�T�U�V�W�X,407,903,212,109,1212,1204,2019/5/30 8:58,���S,Yes,Yes,2019/5/30 7:58,2019/5/30 8:58,,,,,,,,,,,,,,,,,,,,,,,,,,,,,,,,,,,,,,,No,�o��I,2019/5/5 20:32,Yes,Yes,No,Yes,No,No,Yes,,No,No,No,No,No,Yes,Yes,Yes,No,No,171,Yes,1,91,11,No,No,No,���S��`���ǌ�Q,���A�a���P�g�A�V�h�[�V�X,276,178,300,72,267,37,251,19,45,37,35,28,4,1,2,53,21,48,2,14,3,35,6297,157,129,6,1,7,1,32,206,37,Yes,No,No,No,,0.04,129,75,6.3,0.35,98,22,6.7,0.81,126,42,6.9,0.13,164,38,7.8,0.95,432,66,8.5,0.29,122,54,8.7,,,,,,,,,,,,,,,,,,,,,,,,,,,,,,,,,,,,,,,,,,,,,,,,,,,,,,,,,,,,,,,,,,,,,,,,,,,,,,,,,,,,,,,,,,,,,,,,,,,,,,,,,,,,,,,,,,,,,,,,,,,,,,,,,,,,,,,,,,,,,,,,,,,,,,,,,,,,,,,,,,,,,,,,,,,,,,,,,Yes,No,235,�g�p���Ă��Ȃ�,5microg/kg/min�ȉ�,�g�p���Ă��Ȃ�,0.1microg/kg/min�𒴂���,14,�ŏ��̊��𓱓���̔����a�������p��,Yes,p0305,p0101,p1922,p0312,p1951,p1979,662
,T00000000011,900000011,�e�X�g����000011,�e�X�g�J���W���O�O�O�O�P�P,1959/1/19,����,2019/1/14,2019/1/14,����,151,41,2019/1/14 13:19,�\��,�a��,���p,No,Yes,No,�e�X�g�a���P�Q�R�S�T�U�V�W�X,�e�X�g�p���P�Q�R�S�T�U�V�W�X,201,408,1202,1605,1505,1509,2019/1/14 17:43,�]�@,Yes,Yes,,,,,,,,,,,,,,,,,,,,,,,,,,,,,,,,,,,,,,,,,Yes,�o��I,2019/1/14 13:29,Yes,Yes,No,No,No,No,No,,No,Yes,No,Yes,No,No,No,Yes,No,No,169,No,1,148,-18,Yes,No,No,���S��`���ǌ�Q,�׋C�ǎx��,257,159,221,110,186,83,168,69,43,35,46,11,4,1,4,40,27,96,4,14,11,80,5091,175,114,6,2,5,1,49,587,29,No,#VALUE!,No,No,,0.74,158,69,6,0.83,578,34,7.1,0.89,426,10,7.2,0.59,241,47,6.6,0.2,285,89,7.8,0.51,114,71,8.4,,,,,,,,,,,,,,,,,,,,,,,,,,,,,,,,,,,,,,,,,,,,,,,,,,,,,,,,,,,,,,,,,,,,,,,,,,,,,,,,,,,,,,,,,,,,,,,,,,,,,,,,,,,,,,,,,,,,,,,,,,,,,,,,,,,,,,,,,,,,,,,,,,,,,,,,,,,,,,,,,,,,,,,,,,,,,,,,,No,No,918,�g�p����,15microg/kg/min �𒴂���,�g�p���Ă��Ȃ�,0.1microg/kg/min�𒴂���,1,�̕s�S��ICU �����̎�ړI,Yes,p0141,p0621,p1943,p1919,p1948,p0206,252
,T00000000012,900000012,�e�X�g����000012,�e�X�g�J���W���O�O�O�O�P�Q,1979/7/26,����,2019/7/15,2019/7/19,����,136,37,2019/7/15 2:05,�ً},�~�}�O��,���p,RRT/MET,No,Yes,�e�X�g�a���P�Q�R�S�T�U�V�W�X,�e�X�g�p���P�Q�R�S�T�U�V�W�X,211,209,1410,2201,802,401,2019/7/19 21:07,���S,No,Yes,2019/7/19 20:07,2019/7/19 21:07,,,,,,,,,,,,,,,,,,,,,,,,,,,,,,,,,,,,,,,No,No,,No,Yes,No,Yes,Yes,No,No,,Yes,No,No,Yes,No,No,Yes,Yes,No,Yes,185,Yes,1,80,9,Yes,No,No,���S��`���ǌ�Q,���A�a���P�g�A�V�h�[�V�X,71,66,227,80,200,51,186,37,45,37,49,29,1,5,6,46,35,61,2,13,12,45,8845,158,107,7,2,4,4,47,217,55,Yes,No,No,No,,0.75,245,98,7.1,0.95,325,97,8.2,0.54,418,53,6.2,0.64,357,58,6.2,0.25,508,100,6,0.31,406,84,8.5,,,,,,,,,,,,,,,,,,,,,,,,,,,,,,,,,,,,,,,,,,,,,,,,,,,,,,,,,,,,,,,,,,,,,,,,,,,,,,,,,,,,,,,,,,,,,,,,,,,,,,,,,,,,,,,,,,,,,,,,,,,,,,,,,,,,,,,,,,,,,,,,,,,,,,,,,,,,,,,,,,,,,,,,,,,,,,,,,No,No,72,�g�p����,5microg/kg/min�𒴂�15microg/kg/min�ȉ�,0.1microg/kg/min�ȉ�,0.1microg/kg/min�𒴂���,6,�����ڐA���V�s�G���g,No,p0449,p0847,p1506,p1499,p0803,p1605,219
,T00000000013,900000013,�e�X�g����000013,�e�X�g�J���W���O�O�O�O�P�R,1992/12/16,����,2019/5/25,2019/6/8,���S,182,69.6,2019/5/25 9:51,ICU�ł̎�Z,�~�}�O��,���p,No,Yes,No,�e�X�g�a���P�Q�R�S�T�U�V�W�X,�e�X�g�p���P�Q�R�S�T�U�V�W�X,902,1601,1102,203,301,1801,2019/6/8 14:17,���S,Yes,Yes,2019/6/8 9:17,2019/6/8 14:17,,,,,,,,,,,,,,,,,,,,,,,,,,,,,,,,,,,,,,,Yes,�o��I,2019/5/25 11:06,No,No,No,Yes,Yes,No,No,,No,No,Yes,No,Yes,No,No,No,No,No,147,Yes,1,474,0,Yes,No,No,�S�؏ǂ܂��͐S�؉�,�b��,142,63,189,120,156,83,140,64,39,34,36,12,1,2,6,37,11,21,6,15,2,45,3569,133,112,9,1,4,3,9,426,55,No,No,No,No,,0.86,303,85,8.1,0.63,509,12,6.6,0.1,321,72,6.4,0.31,464,68,7.7,0.99,445,64,7.3,0.05,212,90,6.1,,,,,,,,,,,,,,,,,,,,,,,,,,,,,,,,,,,,,,,,,,,,,,,,,,,,,,,,,,,,,,,,,,,,,,,,,,,,,,,,,,,,,,,,,,,,,,,,,,,,,,,,,,,,,,,,,,,,,,,,,,,,,,,,,,,,,,,,,,,,,,,,,,,,,,,,,,,,,,,,,,,,,,,,,,,,,,,,,Yes,No,44,�g�p����,15microg/kg/min �𒴂���,�g�p���Ă��Ȃ�,0.1microg/kg/min�𒴂���,17,�����ڐA���V�s�G���g,No,p0621,p0315,p1102,p0217,p0503,p1601,783
,T00000000014,900000014,�e�X�g����000014,�e�X�g�J���W���O�O�O�O�P�S,2000/7/5,����,2019/12/11,2019/12/26,�]�@,155,62.5,2019/12/11 11:56,�\��,�a��,���p,No,No,No,�e�X�g�a���P�Q�R�S�T�U�V�W�X,�e�X�g�p���P�Q�R�S�T�U�V�W�X,605,1408,1408,1503,1502,1209,2019/12/26 9:29,�]�@,Yes,Yes,2019/12/11 13:56,2019/12/26 9:29,,,,,,,,,,,,,,,,,,,,,,,,,,,,,,,,,,,,,,,No,�o��I,2019/12/11 12:24,Yes,Yes,No,No,No,Yes,No,,No,Yes,Yes,No,No,Yes,Yes,No,Yes,Yes,118,No,1,44,16,No,No,No,�O���ɔ���Ȃ��]���o��,�Ȃ�,87,142,251,145,213,106,194,87,38,35,36,17,4,4,1,48,15,27,5,13,7,71,4658,139,116,7,2,6,4,35,754,49,Yes,Yes,Yes,No,,0.29,512,76,6.8,0.33,559,57,6.3,0.13,593,54,8.6,0.84,446,53,8.8,0.54,238,73,8.5,0.38,497,85,7.9,,,,,,,,,,,,,,,,,,,,,,,,,,,,,,,,,,,,,,,,,,,,,,,,,,,,,,,,,,,,,,,,,,,,,,,,,,,,,,,,,,,,,,,,,,,,,,,,,,,,,,,,,,,,,,,,,,,,,,,,,,,,,,,,,,,,,,,,,,,,,,,,,,,,,,,,,,,,,,,,,,,,,,,,,,,,,,,,,No,No,914,�g�p����,5microg/kg/min�ȉ�,�g�p���Ă��Ȃ�,0.1microg/kg/min�𒴂���,8,�d�Ǖ������Ɖu�s�S��,Yes,p0143,p0599,p1101,p0312,p0452,p0454,692
,T00000000015,900000015,�e�X�g����000015,�e�X�g�J���W���O�O�O�O�P�T,1984/5/13,����,2019/3/4,2019/3/16,�]�@,156,60.8,2019/3/4 8:54,�ً},��p��,�ً}��p,�R�[�h�u���[,Yes,Yes,�e�X�g�a���P�Q�R�S�T�U�V�W�X,�e�X�g�p���P�Q�R�S�T�U�V�W�X,1304,307,2201,1902,306,211,2019/3/16 12:00,�]�@,Yes,Yes,2019/3/4 10:54,2019/3/16 12:00,,,,,,,,,,,,,,,,,,,,,,,,,,,,,,,,,,,,,,,No,No,,No,No,No,No,No,No,No,,Yes,No,Yes,No,No,No,Yes,Yes,Yes,No,191,No,1,68,14,No,No,No,�󎀐�������ICU�����̎�ړI,�Ȃ�,221,112,271,118,232,89,213,75,40,37,41,27,2,3,6,51,33,34,3,14,4,66,5960,149,126,5,3,7,2,26,933,79,Yes,Yes,No,No,,0.63,518,72,6.1,0.62,379,23,6,0.77,245,64,8.8,0.96,491,54,6.3,0.61,492,25,6.8,0.41,95,22,7.3,,,,,,,,,,,,,,,,,,,,,,,,,,,,,,,,,,,,,,,,,,,,,,,,,,,,,,,,,,,,,,,,,,,,,,,,,,,,,,,,,,,,,,,,,,,,,,,,,,,,,,,,,,,,,,,,,,,,,,,,,,,,,,,,,,,,,,,,,,,,,,,,,,,,,,,,,,,,,,,,,,,,,,,,,,,,,,,,,No,Yes,159,�g�p���Ă��Ȃ�,5microg/kg/min�𒴂�15microg/kg/min�ȉ�,�g�p���Ă��Ȃ�,0.1microg/kg/min�𒴂���,13,�ŏ��̊��𓱓���̔����a�������p��,No,p1102,p1501,p0144,p0141,p1398,p0429,683
,T00000000016,900000016,�e�X�g����000016,�e�X�g�J���W���O�O�O�O�P�U,1996/9/23,����,2019/11/9,2019/11/13,�]�@,122,32.7,2019/11/9 12:30,�\��,��p��,�\���p,No,Yes,No,�e�X�g�a���P�Q�R�S�T�U�V�W�X,�e�X�g�p���P�Q�R�S�T�U�V�W�X,1406,1505,1206,311,1701,902,2019/11/13 22:10,�]�@,Yes,No,2019/11/13 19:10,2019/11/13 22:10,,,,,,,,,,,,,,,,,,,,,,,,,,,,,,,,,,,,,,,No,�o��I,2019/11/9 13:38,Yes,No,Yes,Yes,No,No,No,,No,Yes,Yes,No,No,No,No,No,Yes,No,107,Yes,1,247,18,Yes,No,No,���S��`���ǌ�Q,�b��,292,137,207,98,180,66,166,50,40,36,42,10,3,4,1,39,11,86,2,13,6,79,5802,139,113,8,1,6,3,5,589,55,Yes,No,No,No,,0.61,223,82,7.8,0.17,452,91,7.7,0.88,536,64,6.5,0.85,411,28,7.8,0.96,238,14,8.9,0.08,591,97,7.1,,,,,,,,,,,,,,,,,,,,,,,,,,,,,,,,,,,,,,,,,,,,,,,,,,,,,,,,,,,,,,,,,,,,,,,,,,,,,,,,,,,,,,,,,,,,,,,,,,,,,,,,,,,,,,,,,,,,,,,,,,,,,,,,,,,,,,,,,,,,,,,,,,,,,,,,,,,,,,,,,,,,,,,,,,,,,,,,,No,Yes,158,�g�p���Ă��Ȃ�,15microg/kg/min �𒴂���,�g�p���Ă��Ȃ�,0.1microg/kg/min�𒴂���,18,�d�Ǖ������Ɖu�s�S��,Yes,p1999,p1977,p0251,p0610,p1609,p0436,112
,T00000000017,900000017,�e�X�g����000017,�e�X�g�J���W���O�O�O�O�P�V,1958/5/22,�j��,2019/11/11,2019/11/23,����,139,56,2019/11/11 6:27,�ً},��p��,�ً}��p,RRT/MET,No,Yes,�e�X�g�a���P�Q�R�S�T�U�V�W�X,�e�X�g�p���P�Q�R�S�T�U�V�W�X,1211,604,1508,1404,1302,104,2019/11/23 6:21,���S,No,No,2019/11/11 6:27,2019/11/23 6:21,,,,,,,,,,,,,,,,,,,,,,,,,,,,,,,,,,,,,,,No,No,,Yes,Yes,Yes,No,No,No,Yes,,No,No,No,Yes,No,Yes,No,Yes,Yes,No,125,No,1,587,-11,Yes,Yes,No,�Ȃ�,�Ȃ�,154,157,219,148,188,111,173,93,38,34,42,20,1,1,4,56,35,40,4,15,9,94,8139,171,125,10,2,7,2,18,706,59,No,Yes,Yes,No,,0.64,372,15,6.6,0.73,167,84,7.5,0.85,46,94,7.3,0.3,101,81,8.8,0.63,480,93,6.9,0.61,61,44,7.7,,,,,,,,,,,,,,,,,,,,,,,,,,,,,,,,,,,,,,,,,,,,,,,,,,,,,,,,,,,,,,,,,,,,,,,,,,,,,,,,,,,,,,,,,,,,,,,,,,,,,,,,,,,,,,,,,,,,,,,,,,,,,,,,,,,,,,,,,,,,,,,,,,,,,,,,,,,,,,,,,,,,,,,,,,,,,,,,,Yes,Yes,173,�g�p���Ă��Ȃ�,�g�p���Ă��Ȃ�,�g�p���Ă��Ȃ�,0.1microg/kg/min�ȉ�,11,�̕s�S��ICU �����̎�ړI,No,p1977,p1398,p0405,p1962,p1951,p1899,462
,T00000000018,900000018,�e�X�g����000018,�e�X�g�J���W���O�O�O�O�P�W,2019/9/8,�j��,2019/9/18,2019/9/21,����,109,32.1,2019/9/18 23:58,ICU�ł̎�Z,�a��,���p,No,Yes,Yes,�e�X�g�a���P�Q�R�S�T�U�V�W�X,�e�X�g�p���P�Q�R�S�T�U�V�W�X,305,105,1214,212,1208,1506,2019/10/18 16:48,�a��,Yes,Yes,,,,,,,,,,,,,,,,,,,,,,,,,,,,,,,,,,,,,,,,,No,No,,Yes,Yes,Yes,Yes,Yes,No,No,,No,No,No,Yes,Yes,No,No,Yes,No,Yes,40,No,1,295,-15,No,No,No,���S��`���ǌ�Q,���������������ċz�iOSA�j,247,100,228,80,194,43,177,24,42,34,50,12,1,4,2,49,27,63,3,12,6,23,5900,156,114,5,1,7,4,50,129,87,Yes,#VALUE!,No,No,,0.48,570,10,6.8,0.37,411,37,6.2,0.31,173,97,6.5,0.41,328,24,6.5,0.48,98,45,8.6,0.88,81,75,6.4,,,,,,,,,,,,,,,,,,,,,,,,,,,,,,,,,,,,,,,,,,,,,,,,,,,,,,,,,,,,,,,,,,,,,,,,,,,,,,,,,,,,,,,,,,,,,,,,,,,,,,,,,,,,,,,,,,,,,,,,,,,,,,,,,,,,,,,,,,,,,,,,,,,,,,,,,,,,,,,,,,,,,,,,,,,,,,,,,Yes,No,258,�g�p���Ă��Ȃ�,5microg/kg/min�ȉ�,0.1microg/kg/min�𒴂���,0.1microg/kg/min�ȉ�,18,�Ȃ�,Yes,p0210,p0503,p1102,p1501,p0899,p0464,643
,T00000000019,900000019,�e�X�g����000019,�e�X�g�J���W���O�O�O�O�P�X,2000/5/13,����,2019/9/15,2019/9/29,����,159,68.3,2019/9/15 1:14,ICU�ł̎�Z,�~�}�O��,���p,No,Yes,Yes,�e�X�g�a���P�Q�R�S�T�U�V�W�X,�e�X�g�p���P�Q�R�S�T�U�V�W�X,1102,604,1412,1212,1407,1403,2019/10/5 7:42,�a��,No,No,2019/9/15 1:14,2019/10/5 7:42,,,,,,,,,,,,,,,,,,,,,,,,,,,,,,,,,,,,,,,No,�o��I,2019/9/15 1:24,No,Yes,Yes,Yes,Yes,No,No,,Yes,Yes,No,No,Yes,Yes,No,No,Yes,Yes,98,Yes,1,445,-5,Yes,No,No,�Ȃ�,�Ȃ�,231,69,220,126,181,95,162,79,42,37,37,24,4,2,5,41,24,24,4,13,3,82,5653,178,102,7,2,7,4,25,603,7,No,Yes,No,No,,0.12,587,90,8.3,0.45,501,21,8.5,0.27,41,85,8.2,0.57,526,93,8.5,0.69,156,59,7.8,0.89,46,80,8.3,,,,,,,,,,,,,,,,,,,,,,,,,,,,,,,,,,,,,,,,,,,,,,,,,,,,,,,,,,,,,,,,,,,,,,,,,,,,,,,,,,,,,,,,,,,,,,,,,,,,,,,,,,,,,,,,,,,,,,,,,,,,,,,,,,,,,,,,,,,,,,,,,,,,,,,,,,,,,,,,,,,,,,,,,,,,,,,,,Yes,No,632,�g�p���Ă��Ȃ�,5microg/kg/min�ȉ�,�g�p���Ă��Ȃ�,0.1microg/kg/min�𒴂���,17,�����ڐA���V�s�G���g,No,p0307,p1706,p0802,p1970,p1979,p0604,592
,T00000000020,900000020,�e�X�g����000020,�e�X�g�J���W���O�O�O�O�Q�O,1959/6/1,����,2019/1/25,2019/1/29,�]�@,122,40.2,2019/1/25 14:31,�ً},��p��,�ً}��p,RRT/MET,Yes,Yes,�e�X�g�a���P�Q�R�S�T�U�V�W�X,�e�X�g�p���P�Q�R�S�T�U�V�W�X,1214,1213,204,504,101,210,2019/1/29 9:31,�]�@,Yes,No,,,,,,,,,,,,,,,,,,,,,,,,,,,,,,,,,,,,,,,,,No,No,,Yes,Yes,No,Yes,No,Yes,No,,No,Yes,Yes,Yes,No,No,No,No,Yes,Yes,119,Yes,1,189,14,Yes,No,No,�O���ɔ���Ȃ��]���o��,�Ȃ�,104,147,297,117,268,85,253,69,45,36,41,26,2,1,5,37,29,42,9,12,4,64,7212,172,123,4,2,8,3,19,508,76,No,#VALUE!,No,No,,0.1,218,98,7.2,0.43,196,99,8.3,0.03,220,28,7.1,0.41,396,34,6.2,0.63,587,35,6.6,0.46,497,99,7.2,,,,,,,,,,,,,,,,,,,,,,,,,,,,,,,,,,,,,,,,,,,,,,,,,,,,,,,,,,,,,,,,,,,,,,,,,,,,,,,,,,,,,,,,,,,,,,,,,,,,,,,,,,,,,,,,,,,,,,,,,,,,,,,,,,,,,,,,,,,,,,,,,,,,,,,,,,,,,,,,,,,,,,,,,,,,,,,,,No,No,443,�g�p���Ă��Ȃ�,5microg/kg/min�ȉ�,0.1microg/kg/min�ȉ�,�g�p���Ă��Ȃ�,6,�̕s�S��ICU �����̎�ړI,Yes,p1108,p1398,p0335,p0432,p0305,p0330,391